Target
Receptor-type tyrosine-protein phosphatase alpha
Ligand
BDBM50131545
Substrate
Meas. Tech.
ChEMBL_207134 (CHEMBL805118)
Ki
470±n/a nM
Citation
 Liu, GXin, ZLiang, HAbad-Zapatero, CHajduk, PJJanowick, DASzczepankiewicz, BGPei, ZHutchins, CWBallaron, SJStashko, MALubben, THBerg, CERondinone, CMTrevillyan, JMJirousek, MR Selective protein tyrosine phosphatase 1B inhibitors: targeting the second phosphotyrosine binding site with non-carboxylic acid-containing ligands. J Med Chem 46:3437-40 (2003)  
Target
Name:
Receptor-type tyrosine-protein phosphatase alpha
Synonyms:
PTPA PTPRA_HUMAN Protein-tyrosine phosphatase alpha
Type:
Enzyme
Mol. Mass.:
90719.02
Organism:
Homo sapiens (Human)
Description:
P18433
Residue:
802
  
Inhibitor
Name:
BDBM50131545
Synonyms:
(S)-2-(N-(4-(2-(allyloxycarbonylamino)-3-(4-(3-hydroxy-2-(methoxycarbonyl)phenoxy)butylamino)-3-oxopropyl)phenyl)-1-carboxyformamido)benzoic acid 2-{4-[2-(S)-ALLYLOXYCARBONYLAMINO-3-{4-[(2-CARBOXY-PHENYL)-OXALYL-AMINO]-PHENYL}-PROPIONYLAMINO]-BUTOXY}-6-HYDROXY-BENZOIC ACID METHYL ESTER | CHEMBL325029
Type:
Small organic molecule
Emp. Form.:
C34H35N3O12
Mol. Mass.:
677.6546
SMILES:
COC(=O)c1c(O)cccc1OCCCCNC(=O)[C@H](Cc1ccc(cc1)N(C(=O)C(O)=O)c1ccccc1C(O)=O)NC(=O)OCC=C
: