Target
Receptor-type tyrosine-protein phosphatase alpha
Ligand
BDBM50131555
Substrate
Meas. Tech.
ChEMBL_207134 (CHEMBL805118)
Ki
73.0±n/a nM
Citation
 Liu, GXin, ZLiang, HAbad-Zapatero, CHajduk, PJJanowick, DASzczepankiewicz, BGPei, ZHutchins, CWBallaron, SJStashko, MALubben, THBerg, CERondinone, CMTrevillyan, JMJirousek, MR Selective protein tyrosine phosphatase 1B inhibitors: targeting the second phosphotyrosine binding site with non-carboxylic acid-containing ligands. J Med Chem 46:3437-40 (2003)  
Target
Name:
Receptor-type tyrosine-protein phosphatase alpha
Synonyms:
PTPA PTPRA_HUMAN Protein-tyrosine phosphatase alpha
Type:
Enzyme
Mol. Mass.:
90719.02
Organism:
Homo sapiens (Human)
Description:
P18433
Residue:
802
  
Inhibitor
Name:
BDBM50131555
Synonyms:
2-(4-(2-acetamido-3-(4-(1-carboxy-N-(2-carboxyphenyl)formamido)-3-ethylphenyl)propanamido)butoxy)-6-hydroxybenzoic acid CHEMBL117699
Type:
Small organic molecule
Emp. Form.:
C33H35N3O11
Mol. Mass.:
649.6445
SMILES:
CCc1cc(CC(NC(C)=O)C(=O)NCCCCOc2cccc(O)c2C(O)=O)ccc1N(C(=O)C(O)=O)c1ccccc1C(O)=O
: