Target
Prostaglandin G/H synthase 2
Ligand
BDBM50131631
Substrate
Meas. Tech.
ChEMBL_159893 (CHEMBL766721)
IC50
30±n/a nM
Citation
 Almansa, CAlfón, Jde Arriba, AFCavalcanti, FLEscamilla, IGómez, LAMiralles, ASoliva, RBartrolí, JCarceller, EMerlos, MGarcía-Rafanell, J Synthesis and structure-activity relationship of a new series of COX-2 selective inhibitors: 1,5-diarylimidazoles. J Med Chem 46:3463-75 (2003)  
Target
Name:
Prostaglandin G/H synthase 2
Synonyms:
COX2 Cyclooxygenase 2 (COX-2) Cyclooxygenase-2 (COX-2 AA) Cyclooxygenase-2 (COX-2) PGH2_HUMAN PHS II Prostaglandin E synthase/G/H synthase 2 Prostaglandin-endoperoxide synthase 2
Type:
Enzyme
Mol. Mass.:
69003.89
Organism:
Homo sapiens (Human)
Description:
Recombinant Cox-2 provided by Cayman (Cayman Chemical Co.,Ann Arbor, MI).
Residue:
604
  
Inhibitor
Name:
BDBM50131631
Synonyms:
CHEMBL331278 | [1-(4-Fluoro-phenyl)-5-(4-methanesulfonyl-phenyl)-1H-imidazol-2-yl]-phenyl-methanone
Type:
Small organic molecule
Emp. Form.:
C23H17FN2O3S
Mol. Mass.:
420.456
SMILES:
CS(=O)(=O)c1ccc(cc1)-c1cnc(C(=O)c2ccccc2)n1-c1ccc(F)cc1
: