Target
Peroxisome proliferator-activated receptor alpha
Ligand
BDBM50131738
Substrate
Meas. Tech.
ChEMBL_153392 (CHEMBL763845)
EC50
43±n/a nM
Citation
 Nomura, MTanase, TIde, TTsunoda, MSuzuki, MUchiki, HMurakami, KMiyachi, H Design, synthesis, and evaluation of substituted phenylpropanoic acid derivatives as human peroxisome proliferator activated receptor activators. Discovery of potent and human peroxisome proliferator activated receptor alpha subtype-selective activators. J Med Chem 46:3581-99 (2003)  
Target
Name:
Peroxisome proliferator-activated receptor alpha
Synonyms:
NR1C1 PPAR PPAR-alpha PPARA_HUMAN Peroxisome proliferator-activated receptor | Peroxisome proliferator-activated receptor alpha (PPAR alpha)
Type:
Enzyme
Mol. Mass.:
52222.08
Organism:
Homo sapiens (Human)
Description:
Q07869
Residue:
468
  
Inhibitor
Name:
BDBM50131738
Synonyms:
2-[4-Methoxy-3-(4-trifluoromethoxy-benzylcarbamoyl)-benzyl]-butyric acid | CHEMBL116540
Type:
Small organic molecule
Emp. Form.:
C21H22F3NO5
Mol. Mass.:
425.3983
SMILES:
CCC(Cc1ccc(OC)c(c1)C(=O)NCc1ccc(OC(F)(F)F)cc1)C(O)=O
: