Target
Peroxisome proliferator-activated receptor alpha
Ligand
BDBM50131753
Substrate
Meas. Tech.
ChEMBL_153392 (CHEMBL763845)
EC50
5600±n/a nM
Citation
 Nomura, MTanase, TIde, TTsunoda, MSuzuki, MUchiki, HMurakami, KMiyachi, H Design, synthesis, and evaluation of substituted phenylpropanoic acid derivatives as human peroxisome proliferator activated receptor activators. Discovery of potent and human peroxisome proliferator activated receptor alpha subtype-selective activators. J Med Chem 46:3581-99 (2003)  
Target
Name:
Peroxisome proliferator-activated receptor alpha
Synonyms:
NR1C1 PPAR PPAR-alpha PPARA_HUMAN Peroxisome proliferator-activated receptor | Peroxisome proliferator-activated receptor alpha (PPAR alpha)
Type:
Enzyme
Mol. Mass.:
52222.08
Organism:
Homo sapiens (Human)
Description:
Q07869
Residue:
468
  
Inhibitor
Name:
BDBM50131753
Synonyms:
2-[4-Methoxy-3-(4-phenethyl-benzylcarbamoyl)-benzyl]-butyric acid | CHEMBL118279
Type:
Small organic molecule
Emp. Form.:
C28H31NO4
Mol. Mass.:
445.55
SMILES:
CCC(Cc1ccc(OC)c(c1)C(=O)NCc1ccc(CCc2ccccc2)cc1)C(O)=O
: