Target
Peroxisome proliferator-activated receptor gamma
Ligand
BDBM50107543
Substrate
Meas. Tech.
ChEMBL_154192 (CHEMBL762741)
EC50
3000±n/a nM
Citation
 Nomura, MTanase, TIde, TTsunoda, MSuzuki, MUchiki, HMurakami, KMiyachi, H Design, synthesis, and evaluation of substituted phenylpropanoic acid derivatives as human peroxisome proliferator activated receptor activators. Discovery of potent and human peroxisome proliferator activated receptor alpha subtype-selective activators. J Med Chem 46:3581-99 (2003)  
Target
Name:
Peroxisome proliferator-activated receptor gamma
Synonyms:
NR1C3 PPAR-gamma PPARG_HUMAN Peroxisome proliferator-activated receptor gamma (PPAR gamma) Peroxisome proliferator-activated receptor gamma (PPARĪ³) peroxisome proliferator-activated receptor gamma isoform 2
Type:
Nuclear Receptor
Mol. Mass.:
57613.46
Organism:
Homo sapiens (Human)
Description:
P37231
Residue:
505
  
Inhibitor
Name:
BDBM50107543
Synonyms:
4-[4-Methoxy-3-(4-trifluoromethyl-benzylcarbamoyl)-phenyl]-butyric acid | CHEMBL122009
Type:
Small organic molecule
Emp. Form.:
C20H20F3NO4
Mol. Mass.:
395.3723
SMILES:
COc1ccc(CCCC(O)=O)cc1C(=O)NCc1ccc(cc1)C(F)(F)F
: