Target
Alkaline phosphatase, germ cell type
Ligand
BDBM50131869
Substrate
Meas. Tech.
ChEMBL_157081 (CHEMBL765525)
Ki
19000000±n/a nM
Citation
 Swierczek, KPandey, ASPeters, JWHengge, AC A comparison of phosphonothioic acids with phosphonic acids as phosphatase inhibitors. J Med Chem 46:3703-8 (2003)  
Target
Name:
Alkaline phosphatase, germ cell type
Synonyms:
ALPG ALPPL2 PPBN_HUMAN | placental-like alkaline phosphatase preproprotein
Type:
PROTEIN
Mol. Mass.:
57374.31
Organism:
Homo sapiens (Human)
Description:
ChEMBL_29964
Residue:
532
  
Inhibitor
Name:
BDBM50131869
Synonyms:
CHEMBL122577 | Methyl-phosphonothioic acid
Type:
Small organic molecule
Emp. Form.:
CH5O2PS
Mol. Mass.:
112.088
SMILES:
CP(O)(O)=S
: