Target
5-hydroxytryptamine receptor 5A
Ligand
BDBM50132108
Substrate
Meas. Tech.
ChEMBL_3595 (CHEMBL618080)
Ki
135±n/a nM
Citation
 Khorana, NSmith, CHerrick-Davis, KPurohit, ATeitler, MGrella, BDukat, MGlennon, RA Binding of tetrahydrocarboline derivatives at human 5-HT5A receptors. J Med Chem 46:3930-7 (2003)  
Target
Name:
5-hydroxytryptamine receptor 5A
Synonyms:
5-HT-5 5-HT5 5-hydroxytryptamine receptor 5A 5ht5a Serotonin 5a (5-HT5a) receptor | Serotonin receptor 5A
Type:
Enzyme Catalytic Domain
Mol. Mass.:
40749.33
Organism:
MOUSE
Description:
5-HT5 0 MOUSE::P30966
Residue:
357
  
Inhibitor
Name:
BDBM50132108
Synonyms:
4-(5-Methyl-1,3,4,5-tetrahydro-pyrido[4,3-b]indol-2-yl)-1-phenyl-butan-1-one | CHEMBL129476
Type:
Small organic molecule
Emp. Form.:
C22H24N2O
Mol. Mass.:
332.4388
SMILES:
Cn1c2CCN(CCCC(=O)c3ccccc3)Cc2c2ccccc12
: