Target
5-hydroxytryptamine receptor 5A
Ligand
BDBM50132121
Substrate
Meas. Tech.
ChEMBL_3595 (CHEMBL618080)
Ki
180±n/a nM
Citation
 Khorana, NSmith, CHerrick-Davis, KPurohit, ATeitler, MGrella, BDukat, MGlennon, RA Binding of tetrahydrocarboline derivatives at human 5-HT5A receptors. J Med Chem 46:3930-7 (2003)  
Target
Name:
5-hydroxytryptamine receptor 5A
Synonyms:
5-HT-5 5-HT5 5-hydroxytryptamine receptor 5A 5ht5a Serotonin 5a (5-HT5a) receptor | Serotonin receptor 5A
Type:
Enzyme Catalytic Domain
Mol. Mass.:
40749.33
Organism:
MOUSE
Description:
5-HT5 0 MOUSE::P30966
Residue:
357
  
Inhibitor
Name:
BDBM50132121
Synonyms:
8-Chloro-2-[3-(4-fluoro-phenoxy)-propyl]-5-methyl-2,3,4,5-tetrahydro-1H-pyrido[4,3-b]indole | CHEMBL338095
Type:
Small organic molecule
Emp. Form.:
C21H22ClFN2O
Mol. Mass.:
372.864
SMILES:
Cn1c2CCN(CCCOc3ccc(F)cc3)Cc2c2cc(Cl)ccc12
: