Target
Inositol-trisphosphate 3-kinase A
Ligand
BDBM50132165
Substrate
Meas. Tech.
ChEBML_90112
IC50
90000±n/a nM
Citation
 Kwon, YUIm, JChoi, GKim, YSChoi, KYChung, SK Synthesis of three enantiomeric pairs of scyllo-inositol phosphate and molecular interactions between all possible regioisomers of scyllo-inositol phosphate and inositol 1,4,5-trisphosphate 3-kinase. Bioorg Med Chem Lett 13:2981-4 (2003)  
Target
Name:
Inositol-trisphosphate 3-kinase A
Synonyms:
IP3KA_RAT | Itpka
Type:
PROTEIN
Mol. Mass.:
50877.10
Organism:
Rattus norvegicus
Description:
ChEMBL_90112
Residue:
459
  
Inhibitor
Name:
BDBM50132165
Synonyms:
CHEMBL3349692 Phosphoric acid mono-(2,4,6-trihydroxy-3,5-bis-phosphonooxy-cyclohexyl) ester
Type:
Small organic molecule
Emp. Form.:
C6H15O15P3
Mol. Mass.:
420.0956
SMILES:
O[C@H]1[C@H](OP(O)(O)=O)[C@@H](O)[C@H](OP(O)(O)=O)[C@H](O)[C@@H]1OP(O)(O)=O
: