Target
Cyclin-dependent kinase 1/G2/mitotic-specific cyclin-B1/G2/mitotic-specific cyclin-B2/G2/mitotic-specific cyclin-B3
Ligand
BDBM50132170
Substrate
Meas. Tech.
ChEMBL_91999 (CHEMBL700201)
IC50
125000±n/a nM
Citation
 Moravcová, DKrystof, VHavlícek, LMoravec, JLenobel, RStrnad, M Pyrazolo[4,3-d]pyrimidines as new generation of cyclin-dependent kinase inhibitors. Bioorg Med Chem Lett 13:2989-92 (2003)  
Target
Name:
Cyclin-dependent kinase 1/G2/mitotic-specific cyclin-B1/G2/mitotic-specific cyclin-B2/G2/mitotic-specific cyclin-B3
Synonyms:
Cyclin B/Cyclin-Dependent Kinase 1 (CDK1)/G2/mitotic-specific cyclin B2/G2/mitotic-specific cyclin B3 Cyclin-dependent kinase 1/cyclin B
Type:
Mol. Mass.:
Description:
ASSAY_ID of EBI is 40085
Components:
This complex has 4 components.
Component 1
Name:
G2/mitotic-specific cyclin-B3
Synonyms:
CCNB3 CYCB3 G2/mitotic-specific cyclin-B3
Type:
PROTEIN
Mol. Mass.:
157916.84
Organism:
Homo sapiens (Human)
Description:
Residue:
1395
  
Component 2
Name:
G2/mitotic-specific cyclin-B1
Synonyms:
CCNB CCNB1_HUMAN
Type:
Enzyme Subunit
Mol. Mass.:
48340.95
Organism:
Homo sapiens (Human)
Description:
P14635
Residue:
433
  
Component 3
Name:
G2/mitotic-specific cyclin-B2
Synonyms:
CCNB2 Cyclin-dependent kinase 1/cyclin B | G2/mitotic-specific cyclin-B2
Type:
PROTEIN
Mol. Mass.:
45293.13
Organism:
Homo sapiens (Human)
Description:
Residue:
398
  
Component 4
Name:
Cyclin-dependent kinase 1
Synonyms:
CDC2 CDK1 CDKN1 Cell division protein kinase 1 P34CDC2 | p34 protein kinase
Type:
Enzyme Subunit
Mol. Mass.:
34101.08
Organism:
Homo sapiens (Human)
Description:
P06493
Residue:
297
  
Inhibitor
Name:
BDBM50132170
Synonyms:
2-[(9-Isopropyl-9H-purin-6-ylamino)-methyl]-phenol | CHEMBL99787
Type:
Small organic molecule
Emp. Form.:
C15H17N5O
Mol. Mass.:
283.3284
SMILES:
CC(C)n1cnc2c(NCc3ccccc3O)ncnc12
: