Target
Protein kinase C gamma type
Ligand
BDBM50057512
Substrate
Meas. Tech.
ChEMBL_161305 (CHEMBL772113)
Kd
1.5±n/a nM
Citation
 Nakagawa, YIrie, KYamanaka, NOhigashi, HTsuda, K Synthesis and binding selectivity of 7- and 15-decylbenzolactone-V8 for the C1 domains of protein kinase C isozymes. Bioorg Med Chem Lett 13:3015-9 (2003)  
Target
Name:
Protein kinase C gamma type
Synonyms:
KPCG_HUMAN PKC-gamma PRKCG Protein kinase C gamma type Protein kinase C, gamma
Type:
Enzyme
Mol. Mass.:
78458.05
Organism:
Homo sapiens (Human)
Description:
The recombinant human PKC enzymes were produced using a baculovirus expression system in SF9 cells
Residue:
697
  
Inhibitor
Name:
BDBM50057512
Synonyms:
(1aR,1bS,4aR,7aS,7bS,8R,9R,9aS)-4a,7b-dihydroxy-3-(hydroxymethyl)-1,1,6,8-tetramethyl-5-oxo-1,1a,1b,4,4a,5,7a,7b,8,9-decahydro-9aH-cyclopropa[3,4]benzo[1,2-e]azulene-9,9a-diyl dibutanoate PDBu phorbol 12,13-dibutyrate
Type:
Small organic molecule
Emp. Form.:
C28H40O8
Mol. Mass.:
504.6124
SMILES:
CCCC(=O)O[C@@H]1[C@@H](C)[C@]2(O)[C@@H]3C=C(C)C(=O)[C@@]3(O)CC(CO)=C[C@H]2[C@@H]2C(C)(C)[C@]12OC(=O)CCC
: