Target
Glycogen synthase kinase-3 beta
Ligand
BDBM50132312
Substrate
Meas. Tech.
ChEBML_71141
IC50
110±n/a nM
Citation
 Zhang, HCWhite, KBYe, HMcComsey, DFDerian, CKAddo, MFAndrade-Gordon, PEckardt, AJConway, BRWestover, LXu, JZLook, RDemarest, KTEmanuel, SMaryanoff, BE Macrocyclic bisindolylmaleimides as inhibitors of protein kinase C and glycogen synthase kinase-3. Bioorg Med Chem Lett 13:3049-53 (2003)  
Target
Name:
Glycogen synthase kinase-3 beta
Synonyms:
GSK-3 beta GSK3B Glycogen synthase kinase 3 beta (GSK3B) Glycogen synthase kinase-3 beta (GSK-3B) Glycogen synthase kinase-3 beta (GSK3B) Glycogen synthase kinase-3beta (GSK3B) | Serine/threonine-protein kinase GSK3B
Type:
Enzyme
Mol. Mass.:
46756.38
Organism:
Homo sapiens (Human)
Description:
P49841
Residue:
420
  
Inhibitor
Name:
BDBM50132312
Synonyms:
17,20-dimethyl-4,14,17,20,23-pentaazahexacyclo[21.6.1.17,14.02,6.08,13.024,29]hentriaconta-1(30),2(6),7(31),8(13),9,11,24(29),25,27-nonaene-3,5-dione | CHEMBL319265
Type:
Small organic molecule
Emp. Form.:
C28H29N5O2
Mol. Mass.:
467.5622
SMILES:
CN1CCN(C)CCn2cc(C3=C(C(=O)NC3=O)c3cn(CC1)c1ccccc31)c1ccccc21
: