Target
Proto-oncogene tyrosine-protein kinase Src
Ligand
BDBM50132338
Substrate
Meas. Tech.
ChEBML_202617
IC50
700±n/a nM
Citation
 Sundaramoorthi, RShakespeare, WCKeenan, TPMetcalf, CAWang, YMani, UTaylor, MLiu, SBohacek, RSNarula, SSDalgarno, DCvan Schravandijk, MRViolette, SMLiou, SAdams, SRam, MKKeats, JAWeigle, MSawyer, TKWeigele, M Bone-targeted Src kinase inhibitors: novel pyrrolo- and pyrazolopyrimidine analogues. Bioorg Med Chem Lett 13:3063-6 (2003)  
Target
Name:
Proto-oncogene tyrosine-protein kinase Src
Synonyms:
Calmodulin/Proto-oncogene tyrosine-protein kinase Src Proto-oncogene c-Src SRC SRC_HUMAN V-src sarcoma (Schmidt-Ruppin A-2) viral oncogene homolog (avian) p60-Src | pp60c-src
Type:
Protein
Mol. Mass.:
59838.60
Organism:
Homo sapiens (Human)
Description:
P12931
Residue:
536
  
Inhibitor
Name:
BDBM50132338
Synonyms:
CHEMBL102183 | [(2-{4-[4-Amino-5-(3-methoxy-phenyl)-pyrrolo[2,3-d]pyrimidin-7-yl]-phenyl}-ethoxy)-hydroxy-phosphorylmethyl]-phosphonic acid
Type:
Small organic molecule
Emp. Form.:
C22H24N4O7P2
Mol. Mass.:
518.3961
SMILES:
COc1cccc(c1)-c1cn(-c2ccc(CCOP(O)(=O)CP(O)(O)=O)cc2)c2ncnc(N)c12
: