Target
Tyrosine-protein kinase JAK3
Ligand
BDBM50132420
Substrate
Meas. Tech.
ChEBML_91950
IC50
27±n/a nM
Citation
 Adams, CAldous, DJAmendola, SBamborough, PBright, CCrowe, SEastwood, PFenton, GFoster, MHarrison, TKKing, SLai, JLawrence, CLetallec, JPMcCarthy, CMoorcroft, NPage, KRao, SRedford, JSadiq, SSmith, KSouness, JEThurairatnam, SVine, MWyman, B Mapping the kinase domain of Janus Kinase 3. Bioorg Med Chem Lett 13:3105-10 (2003)  
Target
Name:
Tyrosine-protein kinase JAK3
Synonyms:
JAK-3 JAK3_HUMAN Janus kinase 3 (JAK3) L-JAK | Leukocyte janus kinase
Type:
Protein
Mol. Mass.:
125111.08
Organism:
Homo sapiens (Human)
Description:
P52333
Residue:
1124
  
Inhibitor
Name:
BDBM50132420
Synonyms:
3-((1H-pyrrol-2-yl)methylene)-5-(pyridin-3-yl)indolin-2-one CHEMBL2397013 | CHEMBL323994
Type:
Small organic molecule
Emp. Form.:
C18H13N3O
Mol. Mass.:
287.3153
SMILES:
O=C1Nc2ccc(cc2\C1=C\c1ccc[nH]1)-c1cccnc1
: