Target
Tyrosine-protein kinase JAK3
Ligand
BDBM50132423
Substrate
Meas. Tech.
ChEBML_91950
IC50
210±n/a nM
Citation
 Adams, CAldous, DJAmendola, SBamborough, PBright, CCrowe, SEastwood, PFenton, GFoster, MHarrison, TKKing, SLai, JLawrence, CLetallec, JPMcCarthy, CMoorcroft, NPage, KRao, SRedford, JSadiq, SSmith, KSouness, JEThurairatnam, SVine, MWyman, B Mapping the kinase domain of Janus Kinase 3. Bioorg Med Chem Lett 13:3105-10 (2003)  
Target
Name:
Tyrosine-protein kinase JAK3
Synonyms:
JAK-3 JAK3_HUMAN Janus kinase 3 (JAK3) L-JAK | Leukocyte janus kinase
Type:
Protein
Mol. Mass.:
125111.08
Organism:
Homo sapiens (Human)
Description:
P52333
Residue:
1124
  
Inhibitor
Name:
BDBM50132423
Synonyms:
2-Oxo-3-[1-(1H-pyrrol-2-yl)-meth-(Z)-ylidene]-2,3-dihydro-1H-indole-5-carboxylic acid dimethylamide | CHEMBL421213
Type:
Small organic molecule
Emp. Form.:
C16H15N3O2
Mol. Mass.:
281.3092
SMILES:
CN(C)C(=O)c1ccc2NC(=O)\C(=C/c3ccc[nH]3)c2c1
: