Target
Tyrosine-protein phosphatase non-receptor type 22
Ligand
BDBM50132468
Substrate
Meas. Tech.
ChEBML_207577
Ki
>200000±n/a nM
Citation
 Pei, ZLi, XLiu, GAbad-Zapatero, CLubben, TZhang, TBallaron, SJHutchins, CWTrevillyan, JMJirousek, MR Discovery and SAR of novel, potent and selective protein tyrosine phosphatase 1B inhibitors. Bioorg Med Chem Lett 13:3129-32 (2003)  
Target
Name:
Tyrosine-protein phosphatase non-receptor type 22
Synonyms:
3.1.3.48 LyP Lymphoid phosphatase (Lyp) PEST-domain phosphatase PTPN22 Tyrosine-protein phosphatase non-receptor type 22 (LYP) | tyrosine-protein phosphatase non-receptor type 22 isoform 1
Type:
Mol. Mass.:
91712.31
Organism:
Homo sapiens (Human)
Description:
Q9Y2R2
Residue:
807
  
Inhibitor
Name:
BDBM50132468
Synonyms:
2-(4-{2-tert-Butoxycarbonylamino-3-[4-(carboxy-cyclopropylcarbamoyl-methoxy)-phenyl]-propionylamino}-butoxy)-6-hydroxy-benzoic acid methyl ester | CHEMBL105791
Type:
Small organic molecule
Emp. Form.:
C32H41N3O11
Mol. Mass.:
643.6814
SMILES:
COC(=O)c1c(O)cccc1OCCCCNC(=O)C(Cc1ccc(OC(C(O)=O)C(=O)NC2CC2)cc1)NC(=O)OC(C)(C)C
: