Target
Glutamate receptor ionotropic, NMDA 2A
Ligand
BDBM50132481
Substrate
Meas. Tech.
ChEBML_141033
IC50
210±n/a nM
Citation
 Alanine, ABourson, ABüttelmann, BGill, RHeitz, MPMutel, VPinard, ETrube, GWyler, R 1-Benzyloxy-4,5-dihydro-1H-imidazol-2-yl-amines, a novel class of NR1/2B subtype selective NMDA receptor antagonists. Bioorg Med Chem Lett 13:3155-9 (2003)  
Target
Name:
Glutamate receptor ionotropic, NMDA 2A
Synonyms:
Glutamate NMDA receptor; Grin1/Grin2a Grin2a NMDE1_RAT
Type:
Protein
Mol. Mass.:
165478.25
Organism:
Rattus norvegicus (Rat)
Description:
Q00959
Residue:
1464
  
Inhibitor
Name:
BDBM50132481
Synonyms:
(1-Benzyloxy-4,5-dihydro-1H-imidazol-2-yl)-pentyl-amine | CHEMBL107193
Type:
Small organic molecule
Emp. Form.:
C15H23N3O
Mol. Mass.:
261.3626
SMILES:
CCCCCNC1=NCCN1OCc1ccccc1
: