Target
Peptidyl-prolyl cis-trans isomerase FKBP1A
Ligand
BDBM50132560
Substrate
Meas. Tech.
ChEBML_66292
IC50
26±n/a nM
Citation
 Yang, WKeenan, TPRozamus, LWWang, XRivera, VMRollins, CTClackson, THolt, DA Regulation of gene expression by synthetic dimerizers with novel specificity. Bioorg Med Chem Lett 13:3181-4 (2003)  
Target
Name:
Peptidyl-prolyl cis-trans isomerase FKBP1A
Synonyms:
12 kDa FK506-binding protein FK506-binding protein 1A FKB1A_HUMAN FKBP-1A FKBP12 Immunophilin FKBP12 PPIase FKBP1A Rotamase mTOR/FKBP12A/FKBP12B
Type:
Isomerase
Mol. Mass.:
11953.09
Organism:
Homo sapiens (Human)
Description:
P62942
Residue:
108
  
Inhibitor
Name:
BDBM50132560
Synonyms:
(S)-1-((S)-2-Benzo[1,3]dioxol-5-yl-butyryl)-piperidine-2-carboxylic acid (R)-1-(3-carboxymethoxy-phenyl)-3-(3,4-dimethoxy-phenyl)-propyl ester | CHEMBL324646
Type:
Small organic molecule
Emp. Form.:
C36H41NO10
Mol. Mass.:
647.7114
SMILES:
CC[C@H](C(=O)N1CCCC[C@H]1C(=O)O[C@H](CCc1ccc(OC)c(OC)c1)c1cccc(OCC(O)=O)c1)c1ccc2OCOc2c1
: