Target
Retinoic acid receptor gamma
Ligand
BDBM50129720
Substrate
Meas. Tech.
ChEBML_196011
Ki
>10000±n/a nM
Citation
 Gernert, DLAjamie, RArdecky, RABell, MGLeibowitz, MDMais, DAMapes, CMMichellys, PYRungta, DReifel-Miller, ATyhonas, JSYumibe, NGrese, TA Design and synthesis of fluorinated RXR modulators. Bioorg Med Chem Lett 13:3191-5 (2003)  
Target
Name:
Retinoic acid receptor gamma
Synonyms:
NR1B3 RAR-gamma RARG_HUMAN Retinoic acid receptor gamma | Retinoid receptor
Type:
PROTEIN
Mol. Mass.:
50345.43
Organism:
Homo sapiens (Human)
Description:
ChEMBL_1458016
Residue:
454
  
Inhibitor
Name:
BDBM50129720
Synonyms:
(2E,4E,6Z)-7-[3,5-Di-tert-butyl-2-(2,2-difluoro-ethoxy)-phenyl]-3-methyl-octa-2,4,6-trienoic acid CHEMBL42314
Type:
Small organic molecule
Emp. Form.:
C25H34F2O3
Mol. Mass.:
420.5325
SMILES:
C\C(\C=C\C=C(\C)c1cc(cc(c1OCC(F)F)C(C)(C)C)C(C)(C)C)=C/C(O)=O
: