Target
Retinoic acid receptor RXR-alpha
Ligand
BDBM50132583
Substrate
Meas. Tech.
ChEMBL_196750 (CHEMBL803331)
EC50
38±n/a nM
Citation
 Gernert, DLAjamie, RArdecky, RABell, MGLeibowitz, MDMais, DAMapes, CMMichellys, PYRungta, DReifel-Miller, ATyhonas, JSYumibe, NGrese, TA Design and synthesis of fluorinated RXR modulators. Bioorg Med Chem Lett 13:3191-5 (2003)  
Target
Name:
Retinoic acid receptor RXR-alpha
Synonyms:
NR2B1 Nuclear receptor subfamily 4 group A member 2 RXRA Retinoic acid receptor RXR-alpha/gamma Retinoid receptor
Type:
PROTEIN
Mol. Mass.:
50820.38
Organism:
Homo sapiens (Human)
Description:
ChEMBL_1456363
Residue:
462
  
Inhibitor
Name:
BDBM50132583
Synonyms:
(2E,4E,6E)-7-(3,5-Di-tert-butyl-2-ethoxy-phenyl)-8,8,8-trifluoro-3-methyl-octa-2,4,6-trienoic acid | CHEMBL107555
Type:
Small organic molecule
Emp. Form.:
C25H33F3O3
Mol. Mass.:
438.5229
SMILES:
CCOc1c(cc(cc1C(C)(C)C)C(C)(C)C)C(=C/C=C/C(/C)=C/C(O)=O)\C(F)(F)F
: