Target
Farnesyl pyrophosphate synthase
Ligand
BDBM50097889
Substrate
Meas. Tech.
ChEMBL_69845 (CHEMBL681895)
Ki
400±n/a nM
Citation
 Szajnman, SHMontalvetti, AWang, YDocampo, RRodriguez, JB Bisphosphonates derived from fatty acids are potent inhibitors of Trypanosoma cruzi farnesyl pyrophosphate synthase. Bioorg Med Chem Lett 13:3231-5 (2003)  
Target
Name:
Farnesyl pyrophosphate synthase
Synonyms:
Dimethylallyltranstransferase FPP synthase FPPS_HUMAN Farnesyl diphosphate synthase Farnesyl diphosphate synthetase Farnesyl pyrophosphate synthetase KIAA1293 | P14324
Type:
Enzyme
Mol. Mass.:
48272.89
Organism:
Homo sapiens (Human)
Description:
P14324
Residue:
419
  
Inhibitor
Name:
BDBM50097889
Synonyms:
(1-Hydroxy-1-phosphono-hexyl)-phosphonic acid CHEMBL299988
Type:
Small organic molecule
Emp. Form.:
C6H16O7P2
Mol. Mass.:
262.1346
SMILES:
CCCCCC(O)(P(O)(O)=O)P(O)(O)=O
: