Target
Fatty-acid amide hydrolase 1
Ligand
BDBM50132714
Substrate
Meas. Tech.
ChEBML_68778
IC50
0.110000±n/a nM
Citation
 Segall, YQuistad, GBNomura, DKCasida, JE Arachidonylsulfonyl derivatives as cannabinoid CB1 receptor and fatty acid amide hydrolase inhibitors. Bioorg Med Chem Lett 13:3301-3 (2003)  
Target
Name:
Fatty-acid amide hydrolase 1
Synonyms:
Anandamide amidohydrolase FAAH1_MOUSE Faah1 Fatty-acid amide hydrolase (FAAH) Oleamide hydrolase 1
Type:
Hydrolase; single-pass membrane protein; homodimer
Mol. Mass.:
63227.28
Organism:
Mus musculus (mouse)
Description:
Mouse brain membranes were used in the assay.
Residue:
579
  
Inhibitor
Name:
BDBM50132714
Synonyms:
(5Z,8Z,11Z,14Z)-Icosa-5,8,11,14-tetraenesulfonyl fluoride | CHEMBL112486
Type:
Small organic molecule
Emp. Form.:
C20H33FO2S
Mol. Mass.:
356.538
SMILES:
CCCCC\C=C/C\C=C/C\C=C/C\C=C/CCCCS(F)(=O)=O
: