Target
Gonadotropin-releasing hormone receptor
Ligand
BDBM50132725
Substrate
Meas. Tech.
ChEBML_71443
Ki
81±n/a nM
Citation
 Guo, ZZhu, YFTucci, FCGao, YStruthers, RSSaunders, JGross, TDXie, QReinhart, GJChen, C Synthesis and structure-activity relationships of 1-arylmethyl-3-(2-aminopropyl)-5-aryl-6-methyluracils as potent GnRH receptor antagonists. Bioorg Med Chem Lett 13:3311-5 (2003)  
Target
Name:
Gonadotropin-releasing hormone receptor
Synonyms:
GNRHR GRHR GnRH-R Gonadotropin-releasing hormone receptor | Gonadotropin-releasing hormone receptor (GnRH)
Type:
Enzyme
Mol. Mass.:
37749.45
Organism:
Homo sapiens (Human)
Description:
P30968
Residue:
328
  
Inhibitor
Name:
BDBM50132725
Synonyms:
1-(2,6-Difluoro-benzyl)-3-[2-(3-isobutoxy-propylamino)-propyl]-5-(3-methoxy-phenyl)-6-methyl-1H-pyrimidine-2,4-dione | CHEMBL325391
Type:
Small organic molecule
Emp. Form.:
C29H37F2N3O4
Mol. Mass.:
529.6186
SMILES:
COc1cccc(c1)-c1c(C)n(Cc2c(F)cccc2F)c(=O)n(CC(C)NCCCOCC(C)C)c1=O
: