Target
Retinoic acid receptor beta
Ligand
BDBM50133121
Substrate
Meas. Tech.
ChEMBL_195644 (CHEMBL795962)
Ki
8000±n/a nM
Citation
 Michellys, PYArdecky, RJChen, JHD'Arrigo, JGrese, TAKaranewsky, DSLeibowitz, MDLiu, SMais, DAMapes, CMMontrose-Rafizadeh, COgilvie, KMReifel-Miller, ARungta, DThompson, AWTyhonas, JSBoehm, MF Design, synthesis, and structure-activity relationship studies of novel 6,7-locked-[7-(2-alkoxy-3,5-dialkylbenzene)-3-methylocta]-2,4,6-trienoic acids. J Med Chem 46:4087-103 (2003)  
Target
Name:
Retinoic acid receptor beta
Synonyms:
HAP NR1B2 RAR-beta RARB Retinoic acid receptor RXR-alpha/Retinoic acid receptor beta Retinoid receptor
Type:
PROTEIN
Mol. Mass.:
50498.70
Organism:
Homo sapiens (Human)
Description:
ChEMBL_1458015
Residue:
455
  
Inhibitor
Name:
BDBM50133121
Synonyms:
5-{3-[3-tert-Butyl-2-(2,2-difluoro-ethoxy)-5-ethyl-phenyl]-thiophen-2-yl}-3-methyl-penta-2,4-dienoic acid | CHEMBL129887
Type:
Small organic molecule
Emp. Form.:
C24H28F2O3S
Mol. Mass.:
434.539
SMILES:
CCc1cc(-c2ccsc2\C=C\C(\C)=C\C(O)=O)c(OCC(F)F)c(c1)C(C)(C)C
: