Target
Retinoic acid receptor, gamma
Ligand
BDBM50133127
Substrate
Meas. Tech.
ChEMBL_196168 (CHEMBL804941)
Ki
>10000±n/a nM
Citation
 Michellys, PYArdecky, RJChen, JHD'Arrigo, JGrese, TAKaranewsky, DSLeibowitz, MDLiu, SMais, DAMapes, CMMontrose-Rafizadeh, COgilvie, KMReifel-Miller, ARungta, DThompson, AWTyhonas, JSBoehm, MF Design, synthesis, and structure-activity relationship studies of novel 6,7-locked-[7-(2-alkoxy-3,5-dialkylbenzene)-3-methylocta]-2,4,6-trienoic acids. J Med Chem 46:4087-103 (2003)  
Target
Name:
Retinoic acid receptor, gamma
Synonyms:
Retinoic acid receptor gamma
Type:
PROTEIN
Mol. Mass.:
53686.83
Organism:
Rattus norvegicus
Description:
ChEMBL_196168
Residue:
485
  
Inhibitor
Name:
BDBM50133127
Synonyms:
5-{3-[2-(3-Fluoro-propoxy)-3,5-diisopropyl-phenyl]-thiophen-2-yl}-3-methyl-penta-2,4-dienoic acid | CHEMBL131561
Type:
Small organic molecule
Emp. Form.:
C25H31FO3S
Mol. Mass.:
430.575
SMILES:
CC(C)c1cc(C(C)C)c(OCCCF)c(c1)-c1ccsc1\C=C\C(\C)=C\C(O)=O
: