Target
Protein kinase C alpha type
Ligand
BDBM50133236
Substrate
Meas. Tech.
ChEMBL_162571 (CHEMBL768513)
Ki
3.7±n/a nM
Citation
 Sridhar, JWei, ZLNowak, ILewin, NEAyres, JAPearce, LVBlumberg, PMKozikowski, AP New bivalent PKC ligands linked by a carbon spacer: enhancement in binding affinity. J Med Chem 46:4196-204 (2003)  
Target
Name:
Protein kinase C alpha type
Synonyms:
KPCA_BOVIN PRKCA Protein kinase C alpha
Type:
Enzyme
Mol. Mass.:
76842.76
Organism:
Bos taurus (bovine)
Description:
Residue:
672
  
Inhibitor
Name:
BDBM50133236
Synonyms:
CHEMBL337834 | Tetradecanedioic acid ((S)-5-hydroxymethyl-2-isopropyl-1-methyl-3-(S)-oxo-1,2,3,4,5,6-hexahydro-benzo[e][1,4]diazocin-8-yl)-amide ((S)-5-hydroxymethyl-2-isopropyl-1-(S)-methyl-3-oxo-1,2,3,4,5,6-hexahydro-benzo[e][1,4]diazocin-9-yl)-amide
Type:
Small organic molecule
Emp. Form.:
C44H68N6O6
Mol. Mass.:
777.0473
SMILES:
CC(C)[C@@H]1N(C)c2ccc(NC(=O)CCCCCCCCCCCCC(=O)Nc3ccc4C[C@@H](CO)NC(=O)[C@H](C(C)C)N(C)c4c3)cc2C[C@@H](CO)NC1=O
: