Target
Glycogen phosphorylase, liver form
Ligand
BDBM50133432
Substrate
Meas. Tech.
ChEMBL_99042 (CHEMBL712595)
IC50
13±n/a nM
Citation
 Ogawa, AKWilloughby, CABergeron, REllsworth, KPGeissler, WMMyers, RWYao, JHarris, GChapman, KT Glucose-lowering in a db/db mouse model by dihydropyridine diacid glycogen phosphorylase inhibitors. Bioorg Med Chem Lett 13:3405-8 (2003)  
Target
Name:
Glycogen phosphorylase, liver form
Synonyms:
Glycogen Phosphorylase (PYGL) Liver glycogen phosphorylase PYGL_HUMAN
Type:
Homodimer
Mol. Mass.:
97153.98
Organism:
Homo sapiens (Human)
Description:
Dimers associate into a tetramer to form the enzymatically active phosphorylase A.
Residue:
847
  
Inhibitor
Name:
BDBM50133432
Synonyms:
4-(2-Chloro-phenyl)-1-(3,4-dichloro-benzyl)-6-methyl-1,4-dihydro-pyridine-2,3,5-tricarboxylic acid 5-isopropyl ester | CHEMBL334272
Type:
Small organic molecule
Emp. Form.:
C25H22Cl3NO6
Mol. Mass.:
538.804
SMILES:
CC(C)OC(=O)C1=C(C)N(Cc2ccc(Cl)c(Cl)c2)C(C(O)=O)=C(C1c1ccccc1Cl)C(O)=O
: