Target
5-hydroxytryptamine receptor 1D
Ligand
BDBM50133464
Substrate
Meas. Tech.
ChEMBL_1718 (CHEMBL616924)
Ki
0.8±n/a nM
Citation
 Egle, IMacLean, NDemchyshyn, LEdwards, LSlassi, ATehim, A (R)-3-(N-methylpyrrolidin-2-ylmethyl)-5-(1,2,3,6-tetrahydropyridin-4-yl)-1H-indole derivatives as high affinity h5-HT1B/1D ligands. Bioorg Med Chem Lett 13:3419-21 (2003)  
Target
Name:
5-hydroxytryptamine receptor 1D
Synonyms:
5-HT-1D 5-HT1D 5HT1D_HUMAN HTR1DA Serotonin (5-HT) receptor | Serotonin Receptor 1D
Type:
G Protein-Coupled Receptor (GPCR)
Mol. Mass.:
41920.63
Organism:
Homo sapiens (Human)
Description:
Receptor binding assays were performed using human clone stably expressed in CHO cells.
Residue:
377
  
Inhibitor
Name:
BDBM50133464
Synonyms:
3-((R)-1-Methyl-pyrrolidin-2-ylmethyl)-5-[1-(toluene-4-sulfonyl)-1,2,3,6-tetrahydro-pyridin-4-yl]-1H-indole | CHEMBL116876
Type:
Small organic molecule
Emp. Form.:
C26H31N3O2S
Mol. Mass.:
449.608
SMILES:
CN1CCC[C@@H]1Cc1c[nH]c2ccc(cc12)C1=CCN(CC1)S(=O)(=O)c1ccc(C)cc1
: