Target
Capsid scaffolding protein
Ligand
BDBM50107904
Substrate
Meas. Tech.
ChEMBL_158964 (CHEMBL769610)
Ki
20±n/a nM
Citation
 Borthwick, ADDavies, DEErtl, PFExall, AMHaley, TMHart, GJJackson, DLParry, NRPatikis, ATrivedi, NWeingarten, GGWoolven, JM Design and synthesis of pyrrolidine-5,5'-trans-lactams (5-oxo-hexahydropyrrolo[3,2-b]pyrroles) as novel mechanism-based inhibitors of human cytomegalovirus protease. 4. Antiviral activity and plasma stability. J Med Chem 46:4428-49 (2003)  
Target
Name:
Capsid scaffolding protein
Synonyms:
APNG Assembly protein Human cytomegalovirus protease (HCMV Pr) Protease precursor UL80 | pPR
Type:
PROTEIN
Mol. Mass.:
73854.16
Organism:
Human cytomegalovirus (strain AD169) (HHV-5) (Human herpesvirus 5)
Description:
ChEMBL_158958
Residue:
708
  
Inhibitor
Name:
BDBM50107904
Synonyms:
(3S,3aR,6aS)-1-Cyclopropanecarbonyl-4-[(S)-1-(5-dimethylamino-naphthalene-1-sulfonyl)-pyrrolidine-2-carbonyl]-3-methyl-hexahydro-pyrrolo[3,2-b]pyrrol-2-one CHEMBL299435
Type:
Small organic molecule
Emp. Form.:
C28H34N4O5S
Mol. Mass.:
538.658
SMILES:
C[C@H]1[C@@H]2[C@H](CCN2C(=O)[C@@H]2CCCN2S(=O)(=O)c2cccc3c(cccc23)N(C)C)N(C(=O)C2CC2)C1=O
: