Target
Capsid scaffolding protein
Ligand
BDBM50133989
Substrate
Meas. Tech.
ChEMBL_158964 (CHEMBL769610)
Ki
9±n/a nM
Citation
 Borthwick, ADDavies, DEErtl, PFExall, AMHaley, TMHart, GJJackson, DLParry, NRPatikis, ATrivedi, NWeingarten, GGWoolven, JM Design and synthesis of pyrrolidine-5,5'-trans-lactams (5-oxo-hexahydropyrrolo[3,2-b]pyrroles) as novel mechanism-based inhibitors of human cytomegalovirus protease. 4. Antiviral activity and plasma stability. J Med Chem 46:4428-49 (2003)  
Target
Name:
Capsid scaffolding protein
Synonyms:
APNG Assembly protein Human cytomegalovirus protease (HCMV Pr) Protease precursor UL80 | pPR
Type:
PROTEIN
Mol. Mass.:
73854.16
Organism:
Human cytomegalovirus (strain AD169) (HHV-5) (Human herpesvirus 5)
Description:
ChEMBL_158958
Residue:
708
  
Inhibitor
Name:
BDBM50133989
Synonyms:
(S)-2-((3aS,6S,6aR)-4-Cyclopropanecarbonyl-6-methyl-5-oxo-hexahydro-pyrrolo[3,2-b]pyrrole-1-carbonyl)-pyrrolidine-1-carboxylic acid (4'-propoxy-biphenyl-4-yl)-amide | CHEMBL139315
Type:
Small organic molecule
Emp. Form.:
C32H38N4O5
Mol. Mass.:
558.6679
SMILES:
CCCOc1ccc(cc1)-c1ccc(NC(=O)N2CCC[C@H]2C(=O)N2CC[C@H]3[C@H]2[C@H](C)C(=O)N3C(=O)C2CC2)cc1
: