Target
Beta-secretase 1
Ligand
BDBM16250
Substrate
Meas. Tech.
ChEMBL_41372 (CHEMBL653332)
IC50
2±n/a nM
Citation
 John, VBeck, JPBienkowski, MJSinha, SHeinrikson, RL Human beta-secretase (BACE) and BACE inhibitors. J Med Chem 46:4625-30 (2003)  
Target
Name:
Beta-secretase 1
Synonyms:
ASP2 Aspartyl protease 2 BACE1 Beta-secretase (BACE) Beta-secretase 1 (BACE 1) Beta-secretase 1 (BACE1) Beta-site amyloid precursor protein cleaving enzyme 1 Memapsin-2 beta-Secretase (BACE-1) | beta-Secretase (BACE1)
Type:
Protein
Mol. Mass.:
55755.10
Organism:
Homo sapiens (Human)
Description:
P56817
Residue:
501
  
Inhibitor
Name:
BDBM16250
Synonyms:
CHEMBL290001 Substrate-based BACE-1 inhibitor, 22 peptidomimetic memapsin 2 inhibitor 2 | tert-butyl N-[(1S)-1-{[(1S)-1-{[(1R,3S,4S)-1-{[(1S)-1-(benzylcarbamoyl)-2-methylpropyl]carbamoyl}-3-hydroxy-1,6-dimethylheptan-4-yl]carbamoyl}-3-(methylsulfanyl)propyl]carbamoyl}-2-methylpropyl]carbamate
Type:
Small organic molecule
Emp. Form.:
C37H63N5O7S
Mol. Mass.:
721.99
SMILES:
CSCC[C@H](NC(=O)[C@@H](NC(=O)OC(C)(C)C)C(C)C)C(=O)N[C@@H](CC(C)C)[C@@H](O)C[C@@H](C)C(=O)N[C@@H](C(C)C)C(=O)NCc1ccccc1
: