Target
Cycloartenol-C-24-methyltransferase
Ligand
BDBM50134723
Substrate
Meas. Tech.
ChEMBL_203192 (CHEMBL804437)
IC50
>100000±n/a nM
Citation
 Magaraci, FJimenez, CJRodrigues, CRodrigues, JCBraga, MVYardley, Vde Luca-Fradley, KCroft, SLde Souza, WRuiz-Perez, LMUrbina, JGonzalez Pacanowska, DGilbert, IH Azasterols as inhibitors of sterol 24-methyltransferase in Leishmania species and Trypanosoma cruzi. J Med Chem 46:4714-27 (2003)  
Target
Name:
Cycloartenol-C-24-methyltransferase
Synonyms:
24-sterol C-methyltransferase SMT1 | SMT1_ARATH
Type:
PROTEIN
Mol. Mass.:
38266.01
Organism:
Arabidopsis thaliana
Description:
ChEMBL_415082
Residue:
336
  
Inhibitor
Name:
BDBM50134723
Synonyms:
(3S,10S,13S,17S)-17-(1-Hydroxy-1-pyridin-4-yl-ethyl)-10,13-dimethyl-hexadecahydro-cyclopenta[a]phenanthren-3-ol | CHEMBL433876
Type:
Small organic molecule
Emp. Form.:
C26H39NO2
Mol. Mass.:
397.5934
SMILES:
CC(O)([C@H]1CCC2C3CCC4C[C@@H](O)CC[C@]4(C)C3CC[C@]12C)c1ccncc1
: