Target
Cycloartenol-C-24-methyltransferase
Ligand
BDBM50134734
Substrate
Meas. Tech.
ChEMBL_203192 (CHEMBL804437)
IC50
>100000±n/a nM
Citation
 Magaraci, FJimenez, CJRodrigues, CRodrigues, JCBraga, MVYardley, Vde Luca-Fradley, KCroft, SLde Souza, WRuiz-Perez, LMUrbina, JGonzalez Pacanowska, DGilbert, IH Azasterols as inhibitors of sterol 24-methyltransferase in Leishmania species and Trypanosoma cruzi. J Med Chem 46:4714-27 (2003)  
Target
Name:
Cycloartenol-C-24-methyltransferase
Synonyms:
24-sterol C-methyltransferase SMT1 | SMT1_ARATH
Type:
PROTEIN
Mol. Mass.:
38266.01
Organism:
Arabidopsis thaliana
Description:
ChEMBL_415082
Residue:
336
  
Inhibitor
Name:
BDBM50134734
Synonyms:
1-[(3S,10S,17S)-3-(tert-Butyl-dimethyl-silanyloxy)-10-methyl-hexadecahydro-cyclopenta[a]phenanthren-17-yl]-1-(3-chloro-pyridin-4-yl)-ethanol | CHEMBL145672
Type:
Small organic molecule
Emp. Form.:
C31H50ClNO2Si
Mol. Mass.:
532.273
SMILES:
CC(C)(C)[Si](C)(C)O[C@H]1CC[C@@]2(C)C(CCC3C4CC[C@@H](C4CCC23)C(C)(O)c2ccncc2Cl)C1
: