Target
Dihydrofolate reductase
Ligand
BDBM50135145
Substrate
Meas. Tech.
ChEMBL_54777 (CHEMBL884432)
IC50
350±n/a nM
Citation
 Gangjee, AAdair, OOQueener, SF Synthesis and biological evaluation of 2,4-diamino-6-(arylaminomethyl)pyrido[2,3-d]pyrimidines as inhibitors of Pneumocystis carinii and Toxoplasma gondii dihydrofolate reductase and as antiopportunistic infection and antitumor agents. J Med Chem 46:5074-82 (2003)  
Target
Name:
Dihydrofolate reductase
Synonyms:
Bacterial dihydrofolate reductase Dihydrofolate Reductase (DHFR) folA | tmrA
Type:
Enzyme
Mol. Mass.:
17991.61
Organism:
Escherichia coli
Description:
E. coli DHFR was expressed in BL21, and purified to homogeneity.
Residue:
159
  
Inhibitor
Name:
BDBM50135145
Synonyms:
6-[(3,4,5-Trichloro-phenylamino)-methyl]-pyrido[2,3-d]pyrimidine-2,4-diamine | CHEMBL358351
Type:
Small organic molecule
Emp. Form.:
C14H11Cl3N6
Mol. Mass.:
369.636
SMILES:
Nc1nc(N)c2cc(CNc3cc(Cl)c(Cl)c(Cl)c3)cnc2n1
: