Target
5-hydroxytryptamine receptor 1A
Ligand
BDBM50135240
Substrate
Meas. Tech.
ChEMBL_926 (CHEMBL615774)
Ki
9.42±n/a nM
Citation
 Takeuchi, KKohn, TJHonigschmidt, NARocco, VPSpinazze, PGAtkinson, STHertel, LWNelson, DLWainscott, DBAhmad, LJShaw, JThrelkeld, PGWong, DT Advances toward new antidepressants beyond SSRIs: 1-aryloxy-3-piperidinylpropan-2-ols with dual 5-HT1A receptor antagonism/SSRI activities. Part 3. Bioorg Med Chem Lett 13:3939-42 (2003)  
Target
Name:
5-hydroxytryptamine receptor 1A
Synonyms:
5-HT-1A 5-hydroxytryptamine receptor 1A (5-HT-1A) ADRB2RL1 Dopamine D2 receptor and serotonin 1a receptor HTR1A | Serotonin receptor 1A
Type:
Mol. Mass.:
46122.49
Organism:
Homo sapiens (Human)
Description:
Residue:
422
  
Inhibitor
Name:
BDBM50135240
Synonyms:
(S)-1-[4-(4-Methoxy-benzo[b]thiophen-2-yl)-2,2-dimethyl-piperidin-1-yl]-3-(2-methyl-1H-indol-4-yloxy)-propan-2-ol | CHEMBL125349
Type:
Small organic molecule
Emp. Form.:
C28H34N2O3S
Mol. Mass.:
478.646
SMILES:
COc1cccc2sc(cc12)C1CCN(C[C@H](O)COc2cccc3[nH]c(C)cc23)C(C)(C)C1
: