Target
5-hydroxytryptamine receptor 1A
Ligand
BDBM50135259
Substrate
Meas. Tech.
ChEBML_926
Ki
32±n/a nM
Citation
 Takeuchi, KKohn, TJHonigschmidt, NARocco, VPSpinazze, PGAtkinson, STHertel, LWNelson, DLWainscott, DBAhmad, LJShaw, JThrelkeld, PGWong, DT Advances toward new antidepressants beyond SSRIs: 1-aryloxy-3-piperidinylpropan-2-ols with dual 5-HT1A receptor antagonism/SSRI activities. Part 3. Bioorg Med Chem Lett 13:3939-42 (2003)  
Target
Name:
5-hydroxytryptamine receptor 1A
Synonyms:
5-HT-1A 5-hydroxytryptamine receptor 1A (5-HT-1A) ADRB2RL1 Dopamine D2 receptor and serotonin 1a receptor HTR1A | Serotonin receptor 1A
Type:
Mol. Mass.:
46122.49
Organism:
Homo sapiens (Human)
Description:
Residue:
422
  
Inhibitor
Name:
BDBM50135259
Synonyms:
4-{(S)-2-Hydroxy-3-[(2R,4S)-4-(4-methoxy-benzo[b]thiophen-2-yl)-2-methyl-piperidin-1-yl]-propoxy}-1H-indole-2-carboxylic acid amide | CHEMBL130238
Type:
Small organic molecule
Emp. Form.:
C27H31N3O4S
Mol. Mass.:
493.618
SMILES:
COc1cccc2sc(cc12)[C@H]1CCN(C[C@H](O)COc2cccc3[nH]c(cc23)C(N)=O)[C@H](C)C1
: