Target
Adenosylhomocysteinase
Ligand
BDBM50135288
Substrate
Meas. Tech.
ChEMBL_196740 (CHEMBL803151)
IC50
1100±n/a nM
Citation
 Kitade, YKojima, HZulfiqur, FKim, HSWataya, Y Synthesis of 2-fluoronoraristeromycin and its inhibitory activity against Plasmodium falciparum S-adenosyl-L-homocysteine hydrolase. Bioorg Med Chem Lett 13:3963-5 (2003)  
Target
Name:
Adenosylhomocysteinase
Synonyms:
AHCY SAHH | SAHH_HUMAN
Type:
PROTEIN
Mol. Mass.:
47714.06
Organism:
Homo sapiens (Human)
Description:
ChEMBL_1507791
Residue:
432
  
Inhibitor
Name:
BDBM50135288
Synonyms:
(1S,2R,3S,4R)-4-(6-Amino-purin-9-yl)-cyclopentane-1,2,3-triol CHEMBL129014 | NORARISTEROMYCIN
Type:
Small organic molecule
Emp. Form.:
C10H13N5O3
Mol. Mass.:
251.2419
SMILES:
Nc1ncnc2n(cnc12)[C@@H]1C[C@H](O)[C@@H](O)[C@H]1O
: