Target
Mitogen-activated protein kinase 11
Ligand
BDBM50135294
Substrate
Meas. Tech.
ChEBML_124653
IC50
270±n/a nM
Citation
 Liu, LStelmach, JENatarajan, SRChen, MHSingh, SBSchwartz, CDFitzgerald, CEO'Keefe, SJZaller, DMSchmatz, DMDoherty, JB SAR of 3,4-dihydropyrido[3,2-d]pyrimidone p38 inhibitors. Bioorg Med Chem Lett 13:3979-82 (2003)  
Target
Name:
Mitogen-activated protein kinase 11
Synonyms:
MAP kinase p38 MK11_HUMAN Mitogen-activated protein kinase p38 beta SAPK2 Stress-activated protein kinase 2 p38-2 p38b
Type:
Enzyme Catalytic Domain
Mol. Mass.:
41351.73
Organism:
Homo sapiens (Human)
Description:
gi_20128774
Residue:
364
  
Inhibitor
Name:
BDBM50135294
Synonyms:
1-(2-Chloro-6-methyl-phenyl)-6-(4-fluoro-phenylsulfanyl)-3,4-dihydro-1H-pyrido[3,2-d]pyrimidin-2-one | CHEMBL128756
Type:
Small organic molecule
Emp. Form.:
C20H15ClFN3OS
Mol. Mass.:
399.869
SMILES:
Cc1cccc(Cl)c1N1C(=O)NCc2nc(Sc3ccc(F)cc3)ccc12
: