Target
Vasopressin V2 receptor
Ligand
BDBM50135420
Substrate
Meas. Tech.
ChEMBL_214695 (CHEMBL816920)
IC50
8±n/a nM
Citation
 Urbanski, MJChen, RHDemarest, KTGunnet, JLook, REricson, EMurray, WVRybczynski, PJZhang, X 2,5-disubstituted 3,4-dihydro-2H-benzo[b][1,4]thiazepines as potent and selective V2 arginine vasopressin receptor antagonists. Bioorg Med Chem Lett 13:4031-4 (2003)  
Target
Name:
Vasopressin V2 receptor
Synonyms:
ADHR AVPR2 DIR Renal-type arginine vasopressin receptor V2R_HUMAN Vasopressin V2 receptor | Vasopressin receptor
Type:
Receptor
Mol. Mass.:
40295.28
Organism:
Homo sapiens (Human)
Description:
P30518
Residue:
371
  
Inhibitor
Name:
BDBM50135420
Synonyms:
((S)-5-{4-[(Biphenyl-2-carbonyl)-amino]-benzoyl}-2,3,4,5-tetrahydro-benzo[b][1,4]thiazepin-2-yl)-acetic acid | CHEMBL336825
Type:
Small organic molecule
Emp. Form.:
C31H26N2O4S
Mol. Mass.:
522.614
SMILES:
OC(=O)C[C@@H]1CCN(C(=O)c2ccc(NC(=O)c3ccccc3-c3ccccc3)cc2)c2ccccc2S1
: