Target
Cathepsin B
Ligand
BDBM50135547
Substrate
Meas. Tech.
ChEBML_47612
IC50
9.3±n/a nM
Citation
 Greenspan, PDClark, KLCowen, SDMcQuire, LWTommasi, RAFarley, DLQuadros, ECoppa, DEDu, ZFang, ZZhou, HDoughty, JToscano, KTWigg, AMZhou, S N-arylaminonitriles as bioavailable peptidomimetic inhibitors of cathepsin B. Bioorg Med Chem Lett 13:4121-4 (2003)  
Target
Name:
Cathepsin B
Synonyms:
APP secretase CATB_HUMAN CTSB Cathepsin B light chain | Cathepsin B1
Type:
Enzyme
Mol. Mass.:
37819.69
Organism:
Homo sapiens (Human)
Description:
gi_63102437
Residue:
339
  
Inhibitor
Name:
BDBM50135547
Synonyms:
3-{(R)-2-Cyano-2-[(S)-2-(2-methyl-3-oxo-2,3-dihydro-1H-isoindol-5-ylamino)-3-m-tolyl-propionylamino]-ethoxymethyl}-benzoic acid | CHEMBL335407
Type:
Small organic molecule
Emp. Form.:
C30H30N4O5
Mol. Mass.:
526.583
SMILES:
CN1Cc2ccc(N[C@@H](Cc3cccc(C)c3)C(=O)N[C@@H](COCc3cccc(c3)C(O)=O)C#N)cc2C1=O
: