Target
Neuronal acetylcholine receptor subunit alpha-3/beta-2
Ligand
BDBM50135595
Substrate
Meas. Tech.
ChEMBL_143248 (CHEMBL752536)
Ki
56±n/a nM
Citation
 Karig, GLarge, JMSharples, CGSutherland, AGallagher, TWonnacott, S Synthesis and nicotinic binding of novel phenyl derivatives of UB-165. Identifying factors associated with alpha7 selectivity. Bioorg Med Chem Lett 13:2825-8 (2003)  
Target
Name:
Neuronal acetylcholine receptor subunit alpha-3/beta-2
Synonyms:
Neuronal acetylcholine receptor protein alpha-3/beta-2 subunit Neuronal acetylcholine receptor; alpha3/beta2
Type:
Mol. Mass.:
Description:
ASSAY_ID of EBI is 143246
Components:
This complex has 2 components.
Component 1
Name:
Neuronal acetylcholine receptor subunit beta-2
Synonyms:
ACHB2_HUMAN Neuronal acetylcholine receptor protein beta-2 subunit | Nicotinic acetylcholine receptor alpha3/beta2/alpha5
Type:
Protein
Mol. Mass.:
57020.50
Organism:
Homo sapiens (Human)
Description:
P17787
Residue:
502
  
Component 2
Name:
Neuronal acetylcholine receptor subunit alpha-3
Synonyms:
ACHA3_HUMAN Cholinergic, Nicotinic Alpha3Beta2 Cholinergic, Nicotinic Alpha3Beta4x NACHRA3 Neuronal acetylcholine receptor subunit alpha-3 nicotinic central
Type:
Enzyme Catalytic Domain
Mol. Mass.:
57479.03
Organism:
Homo sapiens (Human)
Description:
Cholinergic, Nicotinic Alpha3Beta2 0 HUMAN::P32297
Residue:
505
  
Inhibitor
Name:
BDBM50135595
Synonyms:
2-(6-Phenyl-pyridin-3-yl)-9-aza-bicyclo[4.2.1]non-2-ene | CHEMBL329084
Type:
Small organic molecule
Emp. Form.:
C19H20N2
Mol. Mass.:
276.3755
SMILES:
C1CC2NC1CCC=C2c1ccc(nc1)-c1ccccc1
: