Target
Prolyl endopeptidase
Ligand
BDBM50135630
Substrate
Meas. Tech.
ChEMBL_157493 (CHEMBL765810)
Ki
15.0±n/a nM
Citation
 Bal, GVan der Veken, PAntonov, DLambeir, AMGrellier, PCroft, SLAugustyns, KHaemers, A Prolylisoxazoles: potent inhibitors of prolyloligopeptidase with antitrypanosomal activity. Bioorg Med Chem Lett 13:2875-8 (2003)  
Target
Name:
Prolyl endopeptidase
Synonyms:
PE POP PREP Prolyl oligopeptidase
Type:
Enzyme
Mol. Mass.:
80688.50
Organism:
Homo sapiens (Human)
Description:
P48147
Residue:
710
  
Inhibitor
Name:
BDBM50135630
Synonyms:
(S)-2-[(S)-2-(5-Phenyl-isoxazole-3-carbonyl)-pyrrolidine-1-carbonyl]-pyrrolidine-1-carboxylic acid benzyl ester CHEMBL97152
Type:
Small organic molecule
Emp. Form.:
C27H27N3O5
Mol. Mass.:
473.5204
SMILES:
O=C(OCc1ccccc1)N1CCC[C@H]1C(=O)N1CCC[C@H]1C(=O)c1cc(on1)-c1ccccc1
: