Target
Serine/threonine-protein phosphatase 2A catalytic subunit alpha isoform
Ligand
BDBM50135700
Substrate
Meas. Tech.
ChEBML_161787
IC50
7800±n/a nM
Citation
 Gulledge, BMAggen, JBEng, HSweimeh, KChamberlin, AR Microcystin analogues comprised only of Adda and a single additional amino acid retain moderate activity as PP1/PP2A inhibitors. Bioorg Med Chem Lett 13:2907-11 (2003)  
Target
Name:
Serine/threonine-protein phosphatase 2A catalytic subunit alpha isoform
Synonyms:
PP2AA_BOVIN Serine/threonine protein phosphatase 2A, catalytic subunit, alpha isoform
Type:
PROTEIN
Mol. Mass.:
35586.74
Organism:
Bos taurus
Description:
ChEMBL_161787
Residue:
309
  
Inhibitor
Name:
BDBM50135700
Synonyms:
(S)-2-((4E,6E)-(2S,3S,8S,9S)-3-Acetylamino-9-methoxy-2,6,8-trimethyl-10-phenyl-deca-4,6-dienoylamino)-propionic acid | CHEMBL97992
Type:
Small organic molecule
Emp. Form.:
C25H36N2O5
Mol. Mass.:
444.5637
SMILES:
CO[C@@H](Cc1ccccc1)[C@@H](C)\C=C(/C)\C=C\[C@H](NC(C)=O)[C@H](C)C(=O)N[C@@H](C)C(O)=O
: