Target
Peroxisome proliferator-activated receptor alpha
Ligand
BDBM50135780
Substrate
Meas. Tech.
ChEMBL_153537 (CHEMBL765406)
IC50
24±n/a nM
Citation
 Xu, YMayhugh, DSaeed, AWang, XThompson, RCDominianni, SJKauffman, RFSingh, JBean, JSBensch, WRBarr, RJOsborne, JMontrose-Rafizadeh, CZink, RWYumibe, NPHuang, NLuffer-Atlas, DRungta, DMaise, DEMantlo, NB Design and synthesis of a potent and selective triazolone-based peroxisome proliferator-activated receptor alpha agonist. J Med Chem 46:5121-4 (2003)  
Target
Name:
Peroxisome proliferator-activated receptor alpha
Synonyms:
NR1C1 PPAR PPAR-alpha PPARA_HUMAN Peroxisome proliferator-activated receptor | Peroxisome proliferator-activated receptor alpha (PPAR alpha)
Type:
Enzyme
Mol. Mass.:
52222.08
Organism:
Homo sapiens (Human)
Description:
Q07869
Residue:
468
  
Inhibitor
Name:
BDBM50135780
Synonyms:
2-Methyl-2-(4-{3-[1-(4-methyl-benzyl)-5-oxo-4,5-dihydro-1H-[1,2,4]triazol-3-yl]-propyl}-phenoxy)-propionic acid | CHEMBL424133
Type:
Small organic molecule
Emp. Form.:
C23H27N3O4
Mol. Mass.:
409.4782
SMILES:
Cc1ccc(Cn2nc(CCCc3ccc(OC(C)(C)C(O)=O)cc3)[nH]c2=O)cc1
: