Target
Peroxisome proliferator-activated receptor gamma
Ligand
BDBM50135782
Substrate
Meas. Tech.
ChEMBL_154210 (CHEMBL759455)
IC50
6200±n/a nM
Citation
 Xu, YMayhugh, DSaeed, AWang, XThompson, RCDominianni, SJKauffman, RFSingh, JBean, JSBensch, WRBarr, RJOsborne, JMontrose-Rafizadeh, CZink, RWYumibe, NPHuang, NLuffer-Atlas, DRungta, DMaise, DEMantlo, NB Design and synthesis of a potent and selective triazolone-based peroxisome proliferator-activated receptor alpha agonist. J Med Chem 46:5121-4 (2003)  
Target
Name:
Peroxisome proliferator-activated receptor gamma
Synonyms:
NR1C3 PPAR-gamma PPARG_HUMAN Peroxisome proliferator-activated receptor gamma (PPAR gamma) Peroxisome proliferator-activated receptor gamma (PPARĪ³) peroxisome proliferator-activated receptor gamma isoform 2
Type:
Nuclear Receptor
Mol. Mass.:
57613.46
Organism:
Homo sapiens (Human)
Description:
P37231
Residue:
505
  
Inhibitor
Name:
BDBM50135782
Synonyms:
2-(4-{3-[1-(3-Methoxy-benzyl)-5-oxo-4-propyl-4,5-dihydro-1H-[1,2,4]triazol-3-yl]-propyl}-phenoxy)-2-methyl-propionic acid | CHEMBL345721
Type:
Small organic molecule
Emp. Form.:
C26H33N3O5
Mol. Mass.:
467.5573
SMILES:
CCCn1c(CCCc2ccc(OC(C)(C)C(O)=O)cc2)nn(Cc2cccc(OC)c2)c1=O
: