Target
Farnesyl pyrophosphate synthase
Ligand
BDBM12579
Substrate
Meas. Tech.
ChEMBL_69840 (CHEMBL681891)
Ki
1600±n/a nM
Citation
 Sanders, JMGómez, AOMao, JMeints, GAVan Brussel, EMBurzynska, AKafarski, PGonzález-Pacanowska, DOldfield, E 3-D QSAR investigations of the inhibition of Leishmania major farnesyl pyrophosphate synthase by bisphosphonates. J Med Chem 46:5171-83 (2003)  
Target
Name:
Farnesyl pyrophosphate synthase
Synonyms:
Dimethylallyltranstransferase FPP synthase FPPS_HUMAN Farnesyl diphosphate synthase Farnesyl diphosphate synthetase Farnesyl pyrophosphate synthetase KIAA1293 | P14324
Type:
Enzyme
Mol. Mass.:
48272.89
Organism:
Homo sapiens (Human)
Description:
P14324
Residue:
419
  
Inhibitor
Name:
BDBM12579
Synonyms:
(1-hydroxy-2-phenyl-1-phosphonoethyl)phosphonic acid CHEMBL56556
Type:
Small organic molecule
Emp. Form.:
C8H12O7P2
Mol. Mass.:
282.1242
SMILES:
OC(Cc1ccccc1)(P(O)(O)=O)P(O)(O)=O
: