Target
Farnesyl pyrophosphate synthase
Ligand
BDBM50115109
Substrate
Meas. Tech.
ChEMBL_69840 (CHEMBL681891)
Ki
23±n/a nM
Citation
 Sanders, JMGómez, AOMao, JMeints, GAVan Brussel, EMBurzynska, AKafarski, PGonzález-Pacanowska, DOldfield, E 3-D QSAR investigations of the inhibition of Leishmania major farnesyl pyrophosphate synthase by bisphosphonates. J Med Chem 46:5171-83 (2003)  
Target
Name:
Farnesyl pyrophosphate synthase
Synonyms:
Dimethylallyltranstransferase FPP synthase FPPS_HUMAN Farnesyl diphosphate synthase Farnesyl diphosphate synthetase Farnesyl pyrophosphate synthetase KIAA1293 | P14324
Type:
Enzyme
Mol. Mass.:
48272.89
Organism:
Homo sapiens (Human)
Description:
P14324
Residue:
419
  
Inhibitor
Name:
BDBM50115109
Synonyms:
(5-chloropyridin-2-ylamino)methylenediphosphonic acid [(5-Chloro-pyridin-2-ylamino)-phosphono-methyl]-phosphonic acid | [[(5-chloro-2-pyridinyl)amino]methylene]-1,1-bisphosphonate
Type:
Small organic molecule
Emp. Form.:
C6H9ClN2O6P2
Mol. Mass.:
302.546
SMILES:
OP(O)(=O)C(Nc1ccc(Cl)cn1)P(O)(O)=O
: