Target
Farnesyl pyrophosphate synthase
Ligand
BDBM25313
Substrate
Meas. Tech.
ChEMBL_69840 (CHEMBL681891)
Ki
91±n/a nM
Citation
 Sanders, JMGómez, AOMao, JMeints, GAVan Brussel, EMBurzynska, AKafarski, PGonzález-Pacanowska, DOldfield, E 3-D QSAR investigations of the inhibition of Leishmania major farnesyl pyrophosphate synthase by bisphosphonates. J Med Chem 46:5171-83 (2003)  
Target
Name:
Farnesyl pyrophosphate synthase
Synonyms:
Dimethylallyltranstransferase FPP synthase FPPS_HUMAN Farnesyl diphosphate synthase Farnesyl diphosphate synthetase Farnesyl pyrophosphate synthetase KIAA1293 | P14324
Type:
Enzyme
Mol. Mass.:
48272.89
Organism:
Homo sapiens (Human)
Description:
P14324
Residue:
419
  
Inhibitor
Name:
BDBM25313
Synonyms:
(4-amino-1-hydroxy-1-phosphonobutyl)phosphonic acid CHEMBL870 | bisphosphonate, 65
Type:
Small organic molecule
Emp. Form.:
C4H13NO7P2
Mol. Mass.:
249.096
SMILES:
NCCCC(O)(P(O)(O)=O)P(O)(O)=O
: