Target
Farnesyl pyrophosphate synthase
Ligand
BDBM25298
Substrate
Meas. Tech.
ChEMBL_69840 (CHEMBL681891)
Ki
560.0±n/a nM
Citation
 Sanders, JMGómez, AOMao, JMeints, GAVan Brussel, EMBurzynska, AKafarski, PGonzález-Pacanowska, DOldfield, E 3-D QSAR investigations of the inhibition of Leishmania major farnesyl pyrophosphate synthase by bisphosphonates. J Med Chem 46:5171-83 (2003)  
Target
Name:
Farnesyl pyrophosphate synthase
Synonyms:
Dimethylallyltranstransferase FPP synthase FPPS_HUMAN Farnesyl diphosphate synthase Farnesyl diphosphate synthetase Farnesyl pyrophosphate synthetase KIAA1293 | P14324
Type:
Enzyme
Mol. Mass.:
48272.89
Organism:
Homo sapiens (Human)
Description:
P14324
Residue:
419
  
Inhibitor
Name:
BDBM25298
Synonyms:
(1-hydroxy-1-phosphonoheptyl)phosphonic acid bisphosphonate, 10
Type:
Small organic molecule
Emp. Form.:
C7H18O7P2
Mol. Mass.:
276.1611
SMILES:
CCCCCCC(O)(P(O)(O)=O)P(O)(O)=O
: